BDBM50316353 2-[5-({(2S)-2-Amino-3-[3-(trifluoromethyl)phenyl]propyl}oxy)pyridin-3-yl]-8,9-dimethoxybenzo[c]-2,7-naphthyridin-4-amine::CHEMBL1098302
SMILES COc1cc2ncc3c(N)nc(cc3c2cc1OC)-c1cncc(OC[C@@H](N)Cc2cccc(c2)C(F)(F)F)c1
InChI Key InChIKey=WEKPBIWDHVJAHJ-IBGZPJMESA-N
Data  3 IC50
  Tab Delimited (TSV)   2D SDfile   Computed 3D by Vconf -m prep SDfile
Find this compound or compounds like it in BindingDB:
Activity Spreadsheet -- Enzyme Inhibition Constant Data from BindingDB
Found 1 hit for monomerid = 50316353
TargetRibosomal protein S6 kinase beta-1(Homo sapiens (Human))
Wyeth Research
Curated by ChEMBL
LigandPNGBDBM50316353(2-[5-({(2S)-2-Amino-3-[3-(trifluoromethyl)phenyl]p...)
Affinity DataIC50:  182nM. Assay description: Inhibition of p70S6K
In DepthDetails ArticlePubMed